Reaction Details
TargetKappa-type opioid receptor
LigandBDBM50402137
Substrate/Competitorn/a
Meas. Tech.ChEMBL_884720 (CHEMBL2215601)
Ki 56.5±n/a nM
Citation Fujii, HNakajima, RAkiyama, JYamamoto, NHirayama, SNemoto, TGouda, HHirono, SNagase, H Synthesis of new opioid derivatives with a propellane skeleton and their pharmacologies: part 3, novel propellane derivatives with pentacyclic skeletons. Bioorg Med Chem Lett22:7697-701 (2012) 
 
Kappa-type opioid receptor
Name:Kappa-type opioid receptor
Type:Enzyme
Mol. Mass.:42656.78
Organism:Mus musculus (Mouse)
Description:P33534
Residue:380
BDBM50402137
NameBDBM50402137
Synonyms:CHEMBL2207677
TypeSmall organic molecule
Emp. Form.C22H25NO3
Mol. Mass.351.4388
SMILESOc1ccc2CC34CC5C(=O)CC3N(CC3CC3)CCC4(CC5=O)c2c1