Reaction Details
TargetDelta-type opioid receptor
LigandBDBM50402139
Substrate/Competitorn/a
Meas. Tech.ChEMBL_884721 (CHEMBL2215602)
Ki 52.2±n/a nM
Citation Fujii, HNakajima, RAkiyama, JYamamoto, NHirayama, SNemoto, TGouda, HHirono, SNagase, H Synthesis of new opioid derivatives with a propellane skeleton and their pharmacologies: part 3, novel propellane derivatives with pentacyclic skeletons. Bioorg Med Chem Lett22:7697-701 (2012) 
 
Delta-type opioid receptor
Name:Delta-type opioid receptor
Type:Enzyme Catalytic Domain
Mol. Mass.:40577.25
Organism:MOUSE
Description:P32300
Residue:372
BDBM50402139
NameBDBM50402139
Synonyms:CHEMBL2207679
TypeSmall organic molecule
Emp. Form.C22H25NO2
Mol. Mass.335.4394
SMILESOc1ccc2CC34CC5C=CC3N(CC3CC3)CCC4(CC5=O)c2c1