Reaction Details
TargetMu-type opioid receptor
LigandBDBM50402139
Substrate/Competitorn/a
Meas. Tech.ChEMBL_884722 (CHEMBL2215603)
Ki 17.6±n/a nM
Citation Fujii, HNakajima, RAkiyama, JYamamoto, NHirayama, SNemoto, TGouda, HHirono, SNagase, H Synthesis of new opioid derivatives with a propellane skeleton and their pharmacologies: part 3, novel propellane derivatives with pentacyclic skeletons. Bioorg Med Chem Lett22:7697-701 (2012) 
 
Mu-type opioid receptor
Name:Mu-type opioid receptor
Type:Enzyme Catalytic Domain
Mol. Mass.:11165.58
Organism:GUINEA PIG
Description:P97266
Residue:98
BDBM50402139
NameBDBM50402139
Synonyms:CHEMBL2207679
TypeSmall organic molecule
Emp. Form.C22H25NO2
Mol. Mass.335.4394
SMILESOc1ccc2CC34CC5C=CC3N(CC3CC3)CCC4(CC5=O)c2c1