Reaction Details
TargetCandidapepsin-2
LigandBDBM50402352
Substrate/Competitorn/a
Meas. Tech.ChEMBL_885955 (CHEMBL2215717)
IC50 900±n/a nM
Citation Calugi, CTrabocchi, ADe Bernardis, FArancia, SNavarra, PCauda, RCassone, AGuarna, A Bicyclic peptidomimetics targeting secreted aspartic protease 2 (SAP2) from Candida albicans reveal a constrained inhibitory chemotype. Bioorg Med Chem20:7206-13 (2012) 
 
Candidapepsin-2
Name:Candidapepsin-2
Type:PROTEIN
Mol. Mass.:42313.90
Organism:Candida albicans
Description:ChEMBL_885955
Residue:398
BDBM50402352
NameBDBM50402352
Synonyms:CHEMBL2206674
TypeSmall organic molecule
Emp. Form.C18H28N2O6
Mol. Mass.368.4247
SMILESCOC(=O)[C@H](CC(C)C)N1C[C@@H]2O[C@H]([C@@H](O2)C1=O)C(=O)N1CCCCC1