Reaction Details
TargetCandidapepsin-2
LigandBDBM50402358
Substrate/Competitorn/a
Meas. Tech.ChEMBL_885955 (CHEMBL2215717)
IC50 980±n/a nM
Citation Calugi, CTrabocchi, ADe Bernardis, FArancia, SNavarra, PCauda, RCassone, AGuarna, A Bicyclic peptidomimetics targeting secreted aspartic protease 2 (SAP2) from Candida albicans reveal a constrained inhibitory chemotype. Bioorg Med Chem20:7206-13 (2012) 
 
Candidapepsin-2
Name:Candidapepsin-2
Type:PROTEIN
Mol. Mass.:42313.90
Organism:Candida albicans
Description:ChEMBL_885955
Residue:398
BDBM50402358
NameBDBM50402358
Synonyms:CHEMBL2206669
TypeSmall organic molecule
Emp. Form.C18H22N2O4
Mol. Mass.330.3783
SMILESO=C([C@H]1O[C@@H]2CN(Cc3ccccc3)C(=O)[C@H]1O2)N1CCCCC1