Reaction Details
TargetKappa-type opioid receptor
LigandBDBM50402467
Substrate/Competitorn/a
Meas. Tech.ChEMBL_886623 (CHEMBL2216208)
Ki>1000±n/a nM
Citation Wada, NFujii, HKoyano, KHirayama, SIwai, TNemoto, TNagase, H Synthesis of novel triplet drugs with 1,3,5-trioxazatriquinane skeletons and their pharmacologies. 3: synthesis of novel triplet drugs with the bis(epoxymethano) or bis(dimethylepoxymethano) structure (double-capped triplet). Bioorg Med Chem Lett22:7551-4 (2012) 
 
Kappa-type opioid receptor
Name:Kappa-type opioid receptor
Type:G Protein-Coupled Receptor (GPCR)
Mol. Mass.:42744.99
Organism:Cavia porcellus (domestic guinea pig)
Description:P41144
Residue:380
BDBM50402467
NameBDBM50402467
Synonyms:CHEMBL2204035
TypeSmall organic molecule
Emp. Form.C29H40N2O6
Mol. Mass.512.6377
SMILESCC(C)CN1CC[C@@]23[C@H]4Oc5c2c(C[C@@H]1[C@]3(O)CC[C@]41O[C@H]2N3[C@H](OC2(C)C)C(C)(C)O[C@H]13)ccc5O