Reaction Details
TargetKappa-type opioid receptor
LigandBDBM50402471
Substrate/Competitorn/a
Meas. Tech.ChEMBL_886623 (CHEMBL2216208)
Ki>1000±n/a nM
Citation Wada, NFujii, HKoyano, KHirayama, SIwai, TNemoto, TNagase, H Synthesis of novel triplet drugs with 1,3,5-trioxazatriquinane skeletons and their pharmacologies. 3: synthesis of novel triplet drugs with the bis(epoxymethano) or bis(dimethylepoxymethano) structure (double-capped triplet). Bioorg Med Chem Lett22:7551-4 (2012) 
 
Kappa-type opioid receptor
Name:Kappa-type opioid receptor
Type:G Protein-Coupled Receptor (GPCR)
Mol. Mass.:42744.99
Organism:Cavia porcellus (domestic guinea pig)
Description:P41144
Residue:380
BDBM50402471
NameBDBM50402471
Synonyms:CHEMBL2204030
TypeSmall organic molecule
Emp. Form.C22H26N2O6
Mol. Mass.414.4516
SMILESCN1CC[C@@]23[C@H]4Oc5c2c(C[C@@H]1[C@]3(O)CC[C@]41O[C@H]2CO[C@H]3CO[C@@H]1N23)ccc5O