Reaction Details
TargetMu-type opioid receptor
LigandBDBM50402462
Substrate/Competitorn/a
Meas. Tech.ChEMBL_886625 (CHEMBL2216210)
Ki>1000±n/a nM
Citation Wada, NFujii, HKoyano, KHirayama, SIwai, TNemoto, TNagase, H Synthesis of novel triplet drugs with 1,3,5-trioxazatriquinane skeletons and their pharmacologies. 3: synthesis of novel triplet drugs with the bis(epoxymethano) or bis(dimethylepoxymethano) structure (double-capped triplet). Bioorg Med Chem Lett22:7551-4 (2012) 
 
Mu-type opioid receptor
Name:Mu-type opioid receptor
Type:Enzyme Catalytic Domain
Mol. Mass.:44431.62
Organism:MOUSE
Description:OPIATE Mu OPRM1 MOUSE::P42866
Residue:398
BDBM50402462
NameBDBM50402462
Synonyms:CHEMBL2204024
TypeSmall organic molecule
Emp. Form.C32H38N2O6
Mol. Mass.546.6539
SMILESCC1(C)O[C@@H]2N3[C@H]1OC(C)(C)[C@@H]3O[C@]21CC[C@@]2(O)[C@H]3Cc4ccc(O)c5O[C@@H]1[C@]2(CCN3Cc1ccccc1)c45