Reaction Details
Target5-hydroxytryptamine receptor 6
LigandBDBM50402705
Substrate/Competitorn/a
Meas. Tech.ChEMBL_886900 (CHEMBL2211856)
Ki 2.82±n/a nM
Citation Nirogi, RVBadange, RKambhampati, RChindhe, ADeshpande, ADTiriveedhi, VKandikere, VMuddana, NAbraham, RKhagga, M Design, synthesis and pharmacological evaluation of 4-(piperazin-1-yl methyl)-N1-arylsulfonyl indole derivatives as 5-HT6 receptor ligands. Bioorg Med Chem Lett22:7431-5 (2012) 
 
5-hydroxytryptamine receptor 6
Name:5-hydroxytryptamine receptor 6
Type:G Protein-Coupled Receptor (GPCR)
Mol. Mass.:46968.43
Organism:Homo sapiens (Human)
Description:P50406
Residue:440
BDBM50402705
NameBDBM50402705
Synonyms:CHEMBL2207368
TypeSmall organic molecule
Emp. Form.C19H20BrN3O2S
Mol. Mass.434.35
SMILESBrc1ccccc1S(=O)(=O)n1ccc2c(CN3CCNCC3)cccc12