Reaction Details
Target5-hydroxytryptamine receptor 6
LigandBDBM50402720
Substrate/Competitorn/a
Meas. Tech.ChEMBL_886900 (CHEMBL2211856)
Ki 11.13±n/a nM
Citation Nirogi, RVBadange, RKambhampati, RChindhe, ADeshpande, ADTiriveedhi, VKandikere, VMuddana, NAbraham, RKhagga, M Design, synthesis and pharmacological evaluation of 4-(piperazin-1-yl methyl)-N1-arylsulfonyl indole derivatives as 5-HT6 receptor ligands. Bioorg Med Chem Lett22:7431-5 (2012) 
 
5-hydroxytryptamine receptor 6
Name:5-hydroxytryptamine receptor 6
Type:G Protein-Coupled Receptor (GPCR)
Mol. Mass.:46968.43
Organism:Homo sapiens (Human)
Description:P50406
Residue:440
BDBM50402720
NameBDBM50402720
Synonyms:CHEMBL2207372
TypeSmall organic molecule
Emp. Form.C23H29N3O2S
Mol. Mass.411.56
SMILESCC(C)c1ccc(cc1)S(=O)(=O)n1ccc2c(CN3CCN(C)CC3)cccc12