Reaction Details
TargetDelta-type opioid receptor
LigandBDBM50402781
Substrate/Competitorn/a
Meas. Tech.ChEMBL_887195 (CHEMBL2215303)
Ki 0.800000±n/a nM
Citation Wentland, MPJo, SGargano, JMVanAlstine, MACohen, DJBidlack, JM Redefining the structure-activity relationships of 2,6-methano-3-benzazocines. Part 8. High affinity ligands for opioid receptors in the picomolar Ki range: oxygenated N-(2-[1,1'-biphenyl]-4-ylethyl) analogues of 8-CAC. Bioorg Med Chem Lett22:7340-4 (2012) 
 
Delta-type opioid receptor
Name:Delta-type opioid receptor
Type:G Protein-Coupled Receptor (GPCR)
Mol. Mass.:40382.98
Organism:Homo sapiens (Human)
Description:Competition binding assays were carried out using membrane preparations from transfected HN9.10 cells that constitutively expressed the delta opioid receptor.
Residue:372
BDBM50402781
NameBDBM50402781
Synonyms:CHEMBL2208346
TypeSmall organic molecule
Emp. Form.C34H38F2N2O2
Mol. Mass.544.6745
SMILESCC1C2Cc3ccc(cc3C1(C)CCN2CC1CC1)C(=O)NCCc1ccc(cc1)-c1ccc(OC(F)F)cc1