Reaction Details
TargetDelta-type opioid receptor
LigandBDBM50402774
Substrate/Competitorn/a
Meas. Tech.ChEMBL_887039 (CHEMBL2213830)
EC50 2.8±n/a nM
Citation Wentland, MPJo, SGargano, JMVanAlstine, MACohen, DJBidlack, JM Redefining the structure-activity relationships of 2,6-methano-3-benzazocines. Part 8. High affinity ligands for opioid receptors in the picomolar Ki range: oxygenated N-(2-[1,1'-biphenyl]-4-ylethyl) analogues of 8-CAC. Bioorg Med Chem Lett22:7340-4 (2012) 
 
Delta-type opioid receptor
Name:Delta-type opioid receptor
Type:G Protein-Coupled Receptor (GPCR)
Mol. Mass.:40382.98
Organism:Homo sapiens (Human)
Description:Competition binding assays were carried out using membrane preparations from transfected HN9.10 cells that constitutively expressed the delta opioid receptor.
Residue:372
BDBM50402774
NameBDBM50402774
Synonyms:CHEMBL2208352
TypeSmall organic molecule
Emp. Form.C35H42N2O2
Mol. Mass.522.7202
SMILESCOc1ccc(cc1C)-c1ccc(CCNC(=O)c2ccc3CC4C(C)C(C)(CCN4CC4CC4)c3c2)cc1