Reaction Details
TargetMu-type opioid receptor
LigandBDBM50402778
Substrate/Competitorn/a
Meas. Tech.ChEMBL_887041 (CHEMBL2213832)
EC50 2.3±n/a nM
Citation Wentland, MPJo, SGargano, JMVanAlstine, MACohen, DJBidlack, JM Redefining the structure-activity relationships of 2,6-methano-3-benzazocines. Part 8. High affinity ligands for opioid receptors in the picomolar Ki range: oxygenated N-(2-[1,1'-biphenyl]-4-ylethyl) analogues of 8-CAC. Bioorg Med Chem Lett22:7340-4 (2012) 
 
Mu-type opioid receptor
Name:Mu-type opioid receptor
Type:G Protein-Coupled Receptor (GPCR)
Mol. Mass.:44789.51
Organism:Homo sapiens (Human)
Description:P35372
Residue:400
BDBM50402778
NameBDBM50402778
Synonyms:CHEMBL2208361
TypeSmall organic molecule
Emp. Form.C36H44N2O2
Mol. Mass.536.7468
SMILESCC(C)Oc1ccc(cc1)-c1ccc(CCNC(=O)c2ccc3CC4C(C)C(C)(CCN4CC4CC4)c3c2)cc1