Reaction Details
TargetKappa-type opioid receptor
LigandBDBM50402780
Substrate/Competitorn/a
Meas. Tech.ChEMBL_887048 (CHEMBL2213839)
Ki 1.3±n/a nM
Citation Wentland, MPJo, SGargano, JMVanAlstine, MACohen, DJBidlack, JM Redefining the structure-activity relationships of 2,6-methano-3-benzazocines. Part 8. High affinity ligands for opioid receptors in the picomolar Ki range: oxygenated N-(2-[1,1'-biphenyl]-4-ylethyl) analogues of 8-CAC. Bioorg Med Chem Lett22:7340-4 (2012) 
 
Kappa-type opioid receptor
Name:Kappa-type opioid receptor
Type:G Protein-Coupled Receptor (GPCR)
Mol. Mass.:42648.76
Organism:Homo sapiens (Human)
Description:P41145
Residue:380
BDBM50402780
NameBDBM50402780
Synonyms:CHEMBL2208348
TypeSmall organic molecule
Emp. Form.C33H38N2O2
Mol. Mass.494.667
SMILESCC1C2Cc3ccc(cc3C1(C)CCN2CC1CC1)C(=O)NCCc1ccc(cc1)-c1cccc(O)c1