Reaction Details
TargetMu-type opioid receptor
LigandBDBM50224873
Substrate/Competitorn/a
Meas. Tech.ChEMBL_887196 (CHEMBL2215304)
Ki 0.084000±n/a nM
Citation Wentland, MPJo, SGargano, JMVanAlstine, MACohen, DJBidlack, JM Redefining the structure-activity relationships of 2,6-methano-3-benzazocines. Part 8. High affinity ligands for opioid receptors in the picomolar Ki range: oxygenated N-(2-[1,1'-biphenyl]-4-ylethyl) analogues of 8-CAC. Bioorg Med Chem Lett22:7340-4 (2012) 
 
Mu-type opioid receptor
Name:Mu-type opioid receptor
Type:G Protein-Coupled Receptor (GPCR)
Mol. Mass.:44789.51
Organism:Homo sapiens (Human)
Description:P35372
Residue:400
BDBM50224873
NameBDBM50224873
Synonyms:(6S,11R)-3-cyclopropylmethyl-6,11-dimethyl-1,2,3,4,5,6-hexahydro-2,6-methano-benzo[d]azocine-8-carboxylic acid [2-(4'-methoxy-biphenyl-4-yl)-ethyl]-amide | CHEMBL249985
TypeSmall organic molecule
Emp. Form.C34H40N2O2
Mol. Mass.508.6936
SMILESCOc1ccc(cc1)-c1ccc(CCNC(=O)c2ccc3CC4[C@H](C)[C@](C)(CCN4CC4CC4)c3c2)cc1