Reaction Details
TargetMetabotropic glutamate receptor 5
LigandBDBM44464
Substrate/Competitorn/a
Meas. Tech.ChEMBL_887238 (CHEMBL2215794)
Ki>10000±n/a nM
Citation Rodriguez, ALZhou, YWilliams, RDavid Weaver, CVinson, PNDawson, ESSteckler, TLavreysen, HMackie, CBartolomé, JMMacdonald, GJScott Daniels, JNiswender, CMJones, CKJeffrey Conn, PLindsley, CWStauffer, SR Discovery and SAR of a novel series of non-MPEP site mGlu5 PAMs based on an aryl glycine sulfonamide scaffold. Bioorg Med Chem Lett22:7388-92 (2012) 
 
Metabotropic glutamate receptor 5
Name:Metabotropic glutamate receptor 5
Type:Enzyme
Mol. Mass.:131900.14
Organism:Rattus norvegicus (Rat)
Description:P31424
Residue:1203
BDBM44464
NameBDBM44464
Synonyms:2-(2-chloro-N-mesyl-anilino)-N-(3-chlorophenyl)acetamide CHEMBL1451902 N-(3-chlorophenyl)-2-[(2-chlorophenyl)-methylsulfonyl-amino]ethanamide SMR000135531 | cid_1364364
TypeSmall organic molecule
Emp. Form.C15H14Cl2N2O3S
Mol. Mass.373.254
SMILESCS(=O)(=O)N(CC(=O)Nc1cccc(Cl)c1)c1ccccc1Cl