Reaction Details
TargetPotassium voltage-gated channel subfamily H member 2
LigandBDBM50402817
Substrate/Competitorn/a
Meas. Tech.ChEMBL_887250 (CHEMBL2215806)
IC50 501.19±n/a nM
Citation Furber, MAlcaraz, LLuckhurst, CBahl, ABeaton, HBowers, KCollington, JDenton, RDonald, DKinchin, EMacDonald, CRigby, ARiley, RSoars, MSpringthorpe, BWebborn, P Discovery and evolution of phenoxypiperidine hydroxyamide dual CCR3/H1 antagonists. Part I. Bioorg Med Chem Lett22:7702-6 (2012) 
 
Potassium voltage-gated channel subfamily H member 2
Name:Potassium voltage-gated channel subfamily H member 2
Type:Multi-pass membrane protein
Mol. Mass.:126672.65
Organism:Homo sapiens (Human)
Description:Q12809
Residue:1159
BDBM50402817
NameBDBM50402817
Synonyms:CHEMBL2208432
TypeSmall organic molecule
Emp. Form.C22H24Cl2N4O4
Mol. Mass.479.356
SMILESO[C@H](CNC(=O)n1c2ccccc2[nH]c1=O)CN1CCC(CC1)Oc1ccc(Cl)c(Cl)c1