Reaction Details
TargetPotassium voltage-gated channel subfamily H member 2
LigandBDBM50402136
Substrate/Competitorn/a
Meas. Tech.ChEMBL_887250 (CHEMBL2215806)
IC50 7943.28±n/a nM
Citation Furber, MAlcaraz, LLuckhurst, CBahl, ABeaton, HBowers, KCollington, JDenton, RDonald, DKinchin, EMacDonald, CRigby, ARiley, RSoars, MSpringthorpe, BWebborn, P Discovery and evolution of phenoxypiperidine hydroxyamide dual CCR3/H1 antagonists. Part I. Bioorg Med Chem Lett22:7702-6 (2012) 
 
Potassium voltage-gated channel subfamily H member 2
Name:Potassium voltage-gated channel subfamily H member 2
Type:Multi-pass membrane protein
Mol. Mass.:126672.65
Organism:Homo sapiens (Human)
Description:Q12809
Residue:1159
BDBM50402136
NameBDBM50402136
Synonyms:CHEMBL2207666
TypeSmall organic molecule
Emp. Form.C24H25Cl2N3O4
Mol. Mass.490.379
SMILESO[C@H](CNC(=O)c1c[nH]c(=O)c2ccccc12)CN1CCC(CC1)Oc1ccc(Cl)c(Cl)c1