Reaction Details
TargetHistamine H1 receptor
LigandBDBM50402823
Substrate/Competitorn/a
Meas. Tech.ChEMBL_887254 (CHEMBL2215810)
Ki 0.316±n/a nM
Citation Furber, MAlcaraz, LLuckhurst, CBahl, ABeaton, HBowers, KCollington, JDenton, RDonald, DKinchin, EMacDonald, CRigby, ARiley, RSoars, MSpringthorpe, BWebborn, P Discovery and evolution of phenoxypiperidine hydroxyamide dual CCR3/H1 antagonists. Part I. Bioorg Med Chem Lett22:7702-6 (2012) 
 
Histamine H1 receptor
Name:Histamine H1 receptor
Type:G Protein-Coupled Receptor (GPCR)
Mol. Mass.:55808.72
Organism:Homo sapiens (Human)
Description:Cell pellets from SK-N-MC cells transfected with human H1 receptor were used in binding assay.
Residue:487
BDBM50402823
NameBDBM50402823
Synonyms:CHEMBL2208424
TypeSmall organic molecule
Emp. Form.C22H24Cl2N2O3
Mol. Mass.435.344
SMILESO[C@@H](CCN1CCC(CC1)Oc1ccc(Cl)c(Cl)c1)COc1cccc(c1)C#N