Reaction Details
TargetAlpha-mannosidase 2
LigandBDBM50402980
Substrate/Competitorn/a
Meas. Tech.ChEMBL_885340 (CHEMBL2215203)
Ki 82350±n/a nM
Citation Moorthy, NSBrás, NFRamos, MJFernandes, PA Virtual screening and QSAR study of some pyrrolidine derivatives asa-mannosidase inhibitors for binding feature analysis. Bioorg Med Chem20:6945-59 (2012) 
 
Alpha-mannosidase 2
Name:Alpha-mannosidase 2
Type:Protein
Mol. Mass.:131156.65
Organism:Homo sapiens (Human)
Description:Q16706
Residue:1144
BDBM50402980
NameBDBM50402980
Synonyms:CHEMBL2207394
TypeSmall organic molecule
Emp. Form.C13H20N2O2
Mol. Mass.236.3101
SMILESCC(NC[C@H]1NC[C@H](O)[C@@H]1O)c1ccccc1