Reaction Details
TargetAlpha-mannosidase 2
LigandBDBM50402983
Substrate/Competitorn/a
Meas. Tech.ChEMBL_885340 (CHEMBL2215203)
Ki 232800±n/a nM
Citation Moorthy, NSBrás, NFRamos, MJFernandes, PA Virtual screening and QSAR study of some pyrrolidine derivatives asa-mannosidase inhibitors for binding feature analysis. Bioorg Med Chem20:6945-59 (2012) 
 
Alpha-mannosidase 2
Name:Alpha-mannosidase 2
Type:Protein
Mol. Mass.:131156.65
Organism:Homo sapiens (Human)
Description:Q16706
Residue:1144
BDBM50402983
NameBDBM50402983
Synonyms:CHEMBL2207391
TypeSmall organic molecule
Emp. Form.C10H16N2O2S
Mol. Mass.228.311
SMILESO[C@H]1CN[C@H](CNCc2cccs2)[C@H]1O