Reaction Details
TargetEndoplasmic reticulum mannosyl-oligosaccharide 1,2-alpha-mannosidase
LigandBDBM50169002
Substrate/Competitorn/a
Meas. Tech.ChEMBL_885341 (CHEMBL2215204)
Ki 790±n/a nM
Citation Moorthy, NSBrás, NFRamos, MJFernandes, PA Virtual screening and QSAR study of some pyrrolidine derivatives asa-mannosidase inhibitors for binding feature analysis. Bioorg Med Chem20:6945-59 (2012) 
 
Endoplasmic reticulum mannosyl-oligosaccharide 1,2-alpha-mannosidase
Name:Endoplasmic reticulum mannosyl-oligosaccharide 1,2-alpha-mannosidase
Type:PROTEIN
Mol. Mass.:79590.42
Organism:Homo sapiens (Human)
Description:ChEMBL_885341
Residue:699
BDBM50169002
NameBDBM50169002
Synonyms:(2R,3R,4S)-2-[((S)-Phenyl-1-(R)-2-hydroxy-2-phenyl-ethylamino)-methyl]-pyrrolidine-3,4-diol | CHEMBL188227
TypeSmall organic molecule
Emp. Form.C19H24N2O3
Mol. Mass.328.4055
SMILESO[C@H]([C@H](NC[C@H]1NC[C@H](O)[C@@H]1O)c1ccccc1)c1ccccc1