Reaction Details
TargetEndoplasmic reticulum mannosyl-oligosaccharide 1,2-alpha-mannosidase
LigandBDBM50402976
Substrate/Competitorn/a
Meas. Tech.ChEMBL_885341 (CHEMBL2215204)
Ki 74310±n/a nM
Citation Moorthy, NSBrás, NFRamos, MJFernandes, PA Virtual screening and QSAR study of some pyrrolidine derivatives asa-mannosidase inhibitors for binding feature analysis. Bioorg Med Chem20:6945-59 (2012) 
 
Endoplasmic reticulum mannosyl-oligosaccharide 1,2-alpha-mannosidase
Name:Endoplasmic reticulum mannosyl-oligosaccharide 1,2-alpha-mannosidase
Type:PROTEIN
Mol. Mass.:79590.42
Organism:Homo sapiens (Human)
Description:ChEMBL_885341
Residue:699
BDBM50402976
NameBDBM50402976
Synonyms:CHEMBL2207398
TypeSmall organic molecule
Emp. Form.C12H18N2O2
Mol. Mass.222.2835
SMILESO[C@H]1CN[C@H](CCNc2ccccc2)[C@H]1O