Reaction Details
TargetEndoplasmic reticulum mannosyl-oligosaccharide 1,2-alpha-mannosidase
LigandBDBM50402979
Substrate/Competitorn/a
Meas. Tech.ChEMBL_885341 (CHEMBL2215204)
Ki 44840±n/a nM
Citation Moorthy, NSBrás, NFRamos, MJFernandes, PA Virtual screening and QSAR study of some pyrrolidine derivatives asa-mannosidase inhibitors for binding feature analysis. Bioorg Med Chem20:6945-59 (2012) 
 
Endoplasmic reticulum mannosyl-oligosaccharide 1,2-alpha-mannosidase
Name:Endoplasmic reticulum mannosyl-oligosaccharide 1,2-alpha-mannosidase
Type:PROTEIN
Mol. Mass.:79590.42
Organism:Homo sapiens (Human)
Description:ChEMBL_885341
Residue:699
BDBM50402979
NameBDBM50402979
Synonyms:CHEMBL2207395
TypeSmall organic molecule
Emp. Form.C15H23N3O3
Mol. Mass.293.3614
SMILESCC(=O)N(CNC[C@H]1NC[C@H](O)[C@@H]1O)Cc1ccccc1