Reaction Details
TargetEndoplasmic reticulum mannosyl-oligosaccharide 1,2-alpha-mannosidase
LigandBDBM50402983
Substrate/Competitorn/a
Meas. Tech.ChEMBL_885341 (CHEMBL2215204)
Ki 77660±n/a nM
Citation Moorthy, NSBrás, NFRamos, MJFernandes, PA Virtual screening and QSAR study of some pyrrolidine derivatives asa-mannosidase inhibitors for binding feature analysis. Bioorg Med Chem20:6945-59 (2012) 
 
Endoplasmic reticulum mannosyl-oligosaccharide 1,2-alpha-mannosidase
Name:Endoplasmic reticulum mannosyl-oligosaccharide 1,2-alpha-mannosidase
Type:PROTEIN
Mol. Mass.:79590.42
Organism:Homo sapiens (Human)
Description:ChEMBL_885341
Residue:699
BDBM50402983
NameBDBM50402983
Synonyms:CHEMBL2207391
TypeSmall organic molecule
Emp. Form.C10H16N2O2S
Mol. Mass.228.311
SMILESO[C@H]1CN[C@H](CNCc2cccs2)[C@H]1O