Reaction Details
TargetMitochondrial carnitine/acylcarnitine carrier protein
LigandBDBM50403026
Substrate/Competitorn/a
Meas. Tech.ChEMBL_887459 (CHEMBL2217068)
IC50 5000±n/a nM
Citation Ceccarelli, SMChomienne, OGubler, MArduini, A Carnitine palmitoyltransferase (CPT) modulators: a medicinal chemistry perspective on 35 years of research. J Med Chem54:3109-52 (2011) 
 
Mitochondrial carnitine/acylcarnitine carrier protein
Name:Mitochondrial carnitine/acylcarnitine carrier protein
Type:PROTEIN
Mol. Mass.:32956.45
Organism:Homo sapiens (Human)
Description:ChEMBL_887459
Residue:301
BDBM50403026
NameBDBM50403026
Synonyms:CHEMBL2216788
TypeSmall organic molecule
Emp. Form.C17H33NO4
Mol. Mass.315.4482
SMILESCCCCCCCCCC(=O)O[C@@H](CC([O-])=O)C[N+](C)(C)C