Reaction Details
TargetCarnitine O-palmitoyltransferase 1, liver isoform
LigandBDBM50403028
Substrate/Competitorn/a
Meas. Tech.ChEMBL_887374 (CHEMBL2216983)
IC50 240±n/a nM
Citation Ceccarelli, SMChomienne, OGubler, MArduini, A Carnitine palmitoyltransferase (CPT) modulators: a medicinal chemistry perspective on 35 years of research. J Med Chem54:3109-52 (2011) 
 
Carnitine O-palmitoyltransferase 1, liver isoform
Name:Carnitine O-palmitoyltransferase 1, liver isoform
Type:PROTEIN
Mol. Mass.:88389.31
Organism:Homo sapiens (Human)
Description:ChEMBL_887463
Residue:773
BDBM50403028
NameBDBM50403028
Synonyms:CHEMBL2216769
TypeSmall organic molecule
Emp. Form.C35H58N7O20P3S
Mol. Mass.1021.856
SMILESCCCCCCCC[C@H]1OC(=O)C(CSCCNC(=O)CCNC(=O)[C@H](O)C(C)(C)COP(O)(=O)OP(O)(=O)OC[C@H]2O[C@H]([C@H](O)[C@@H]2OP(O)(O)=O)n2cnc3c(N)cnnc23)[C@@H]1C(O)=O