Reaction Details
TargetCarnitine O-palmitoyltransferase 2, mitochondrial
LigandBDBM50122839
Substrate/Competitorn/a
Meas. Tech.ChEMBL_887417 (CHEMBL2217026)
IC50 160±n/a nM
Citation Ceccarelli, SMChomienne, OGubler, MArduini, A Carnitine palmitoyltransferase (CPT) modulators: a medicinal chemistry perspective on 35 years of research. J Med Chem54:3109-52 (2011) 
 
Carnitine O-palmitoyltransferase 2, mitochondrial
Name:Carnitine O-palmitoyltransferase 2, mitochondrial
Type:PROTEIN
Mol. Mass.:73789.25
Organism:Homo sapiens (Human)
Description:ChEMBL_887455
Residue:658
BDBM50122839
NameBDBM50122839
Synonyms:CHEMBL106227 | [3-Carboxy-2-(3-tetradecyl-ureido)-propyl]-trimethyl-ammonium
TypeSmall organic molecule
Emp. Form.C22H45N3O3
Mol. Mass.399.611
(=O)N[C@H](CC([O-])=O)C[N+](C)(C)C