Reaction Details
TargetCarnitine O-palmitoyltransferase 2, mitochondrial
LigandBDBM50403033
Substrate/Competitorn/a
Meas. Tech.ChEMBL_887417 (CHEMBL2217026)
IC50 140±n/a nM
Citation Ceccarelli, SMChomienne, OGubler, MArduini, A Carnitine palmitoyltransferase (CPT) modulators: a medicinal chemistry perspective on 35 years of research. J Med Chem54:3109-52 (2011) 
 
Carnitine O-palmitoyltransferase 2, mitochondrial
Name:Carnitine O-palmitoyltransferase 2, mitochondrial
Type:PROTEIN
Mol. Mass.:73789.25
Organism:Homo sapiens (Human)
Description:ChEMBL_887455
Residue:658
BDBM50403033
NameBDBM50403033
Synonyms:CHEMBL1231507
TypeSmall organic molecule
Emp. Form.C23H46N2O3
Mol. Mass.398.6229
(=O)N[C@H](CC([O-])=O)C[N+](C)(C)C