Reaction Details
TargetCarnitine O-palmitoyltransferase 1, liver isoform
LigandBDBM50403035
Substrate/Competitorn/a
Meas. Tech.ChEMBL_887463 (CHEMBL2217072)
IC50>100000±n/a nM
Citation Ceccarelli, SMChomienne, OGubler, MArduini, A Carnitine palmitoyltransferase (CPT) modulators: a medicinal chemistry perspective on 35 years of research. J Med Chem54:3109-52 (2011) 
 
Carnitine O-palmitoyltransferase 1, liver isoform
Name:Carnitine O-palmitoyltransferase 1, liver isoform
Type:PROTEIN
Mol. Mass.:88389.31
Organism:Homo sapiens (Human)
Description:ChEMBL_887463
Residue:773
BDBM50403035
NameBDBM50403035
Synonyms:OXFENICINE
TypeSmall organic molecule
Emp. Form.C8H9NO3
Mol. Mass.167.162
SMILESN[C@H](C(O)=O)c1ccc(O)cc1