Reaction Details
TargetCarnitine O-palmitoyltransferase 1, muscle isoform
LigandBDBM50403041
Substrate/Competitorn/a
Meas. Tech.ChEMBL_887418 (CHEMBL2217027)
IC50 150±n/a nM
Citation Ceccarelli, SMChomienne, OGubler, MArduini, A Carnitine palmitoyltransferase (CPT) modulators: a medicinal chemistry perspective on 35 years of research. J Med Chem54:3109-52 (2011) 
 
Carnitine O-palmitoyltransferase 1, muscle isoform
Name:Carnitine O-palmitoyltransferase 1, muscle isoform
Type:PROTEIN
Mol. Mass.:88241.28
Organism:Rattus norvegicus
Description:ChEMBL_887447
Residue:772
BDBM50403041
NameBDBM50403041
Synonyms:CHEMBL2216776
TypeSmall organic molecule
Emp. Form.C21H16F3N3OS
Mol. Mass.415.431
SMILESFC(F)(F)c1cccc(Cn2nc(C(=O)NCc3cccs3)c3ccccc23)c1