Reaction Details
TargetCarnitine O-palmitoyltransferase 1, muscle isoform
LigandBDBM50403038
Substrate/Competitorn/a
Meas. Tech.ChEMBL_887418 (CHEMBL2217027)
IC50 180±n/a nM
Citation Ceccarelli, SMChomienne, OGubler, MArduini, A Carnitine palmitoyltransferase (CPT) modulators: a medicinal chemistry perspective on 35 years of research. J Med Chem54:3109-52 (2011) 
 
Carnitine O-palmitoyltransferase 1, muscle isoform
Name:Carnitine O-palmitoyltransferase 1, muscle isoform
Type:PROTEIN
Mol. Mass.:88241.28
Organism:Rattus norvegicus
Description:ChEMBL_887447
Residue:772
BDBM50403038
NameBDBM50403038
Synonyms:CHEMBL2216777
TypeSmall organic molecule
Emp. Form.C26H26N2O6S
Mol. Mass.494.559
SMILESCOc1ccc(C)cc1S(=O)(=O)N1CCCc2ccc(cc12)C(=O)Nc1ccc(CC(O)=O)cc1