Reaction Details
TargetCarnitine O-palmitoyltransferase 1, muscle isoform
LigandBDBM50403040
Substrate/Competitorn/a
Meas. Tech.ChEMBL_887418 (CHEMBL2217027)
IC50 55±n/a nM
Citation Ceccarelli, SMChomienne, OGubler, MArduini, A Carnitine palmitoyltransferase (CPT) modulators: a medicinal chemistry perspective on 35 years of research. J Med Chem54:3109-52 (2011) 
 
Carnitine O-palmitoyltransferase 1, muscle isoform
Name:Carnitine O-palmitoyltransferase 1, muscle isoform
Type:PROTEIN
Mol. Mass.:88241.28
Organism:Rattus norvegicus
Description:ChEMBL_887447
Residue:772
BDBM50403040
NameBDBM50403040
Synonyms:CHEMBL2216779
TypeSmall organic molecule
Emp. Form.C23H19ClN2O6S
Mol. Mass.486.925
SMILESCOc1ccc(Cl)cc1S(=O)(=O)N1CCc2ccc(cc12)C(=O)Nc1ccc(cc1)C(O)=O