Reaction Details
TargetCarnitine O-palmitoyltransferase 2, mitochondrial
LigandBDBM50403037
Substrate/Competitorn/a
Meas. Tech.ChEMBL_887441 (CHEMBL2217050)
IC50 30700±n/a nM
Citation Ceccarelli, SMChomienne, OGubler, MArduini, A Carnitine palmitoyltransferase (CPT) modulators: a medicinal chemistry perspective on 35 years of research. J Med Chem54:3109-52 (2011) 
 
Carnitine O-palmitoyltransferase 2, mitochondrial
Name:Carnitine O-palmitoyltransferase 2, mitochondrial
Type:PROTEIN
Mol. Mass.:74118.53
Organism:Rattus norvegicus
Description:ChEMBL_887443
Residue:658
BDBM50403037
NameBDBM50403037
Synonyms:CHEMBL2216774
TypeSmall organic molecule
Emp. Form.C21H21N3O2S
Mol. Mass.379.475
SMILESO=C(COc1ccccc1)N1CCCC[C@@H]1c1nc(cs1)-c1ccccn1