Reaction Details
TargetCarnitine O-palmitoyltransferase 2, mitochondrial
LigandBDBM50403038
Substrate/Competitorn/a
Meas. Tech.ChEMBL_887441 (CHEMBL2217050)
IC50 16700±n/a nM
Citation Ceccarelli, SMChomienne, OGubler, MArduini, A Carnitine palmitoyltransferase (CPT) modulators: a medicinal chemistry perspective on 35 years of research. J Med Chem54:3109-52 (2011) 
 
Carnitine O-palmitoyltransferase 2, mitochondrial
Name:Carnitine O-palmitoyltransferase 2, mitochondrial
Type:PROTEIN
Mol. Mass.:74118.53
Organism:Rattus norvegicus
Description:ChEMBL_887443
Residue:658
BDBM50403038
NameBDBM50403038
Synonyms:CHEMBL2216777
TypeSmall organic molecule
Emp. Form.C26H26N2O6S
Mol. Mass.494.559
SMILESCOc1ccc(C)cc1S(=O)(=O)N1CCCc2ccc(cc12)C(=O)Nc1ccc(CC(O)=O)cc1