Reaction Details
TargetCarnitine O-palmitoyltransferase 1, liver isoform
LigandBDBM50403039
Substrate/Competitorn/a
Meas. Tech.ChEMBL_887463 (CHEMBL2217072)
IC50 16±n/a nM
Citation Ceccarelli, SMChomienne, OGubler, MArduini, A Carnitine palmitoyltransferase (CPT) modulators: a medicinal chemistry perspective on 35 years of research. J Med Chem54:3109-52 (2011) 
 
Carnitine O-palmitoyltransferase 1, liver isoform
Name:Carnitine O-palmitoyltransferase 1, liver isoform
Type:PROTEIN
Mol. Mass.:88389.31
Organism:Homo sapiens (Human)
Description:ChEMBL_887463
Residue:773
BDBM50403039
NameBDBM50403039
Synonyms:CHEMBL2216778
TypeSmall organic molecule
Emp. Form.C23H18ClFN2O7S
Mol. Mass.520.915
SMILESCOc1ccc(Cl)cc1S(=O)(=O)N1CC(Oc2ccc(cc12)C(=O)Nc1cccc(F)c1)C(O)=O