Reaction Details
TargetCarnitine O-palmitoyltransferase 2, mitochondrial
LigandBDBM61402
Substrate/Competitorn/a
Meas. Tech.ChEMBL_887443 (CHEMBL2217052)
IC50 79000±n/a nM
Citation Ceccarelli, SMChomienne, OGubler, MArduini, A Carnitine palmitoyltransferase (CPT) modulators: a medicinal chemistry perspective on 35 years of research. J Med Chem54:3109-52 (2011) 
 
Carnitine O-palmitoyltransferase 2, mitochondrial
Name:Carnitine O-palmitoyltransferase 2, mitochondrial
Type:PROTEIN
Mol. Mass.:74118.53
Organism:Rattus norvegicus
Description:ChEMBL_887443
Residue:658
BDBM61402
NameBDBM61402
Synonyms:(Z)-2-butenedioic acid;2-(2,2-dicyclohexylethyl)piperidine 2-(2,2-dicyclohexylethyl)piperidine;maleic acid CHEMBL75880 Perhexiline cid_5284439 | perhexiline maleate
TypeSmall organic molecule
Emp. Form.C19H35N
Mol. Mass.277.4879
SMILESC(C(C1CCCCC1)C1CCCCC1)C1CCCCN1