Reaction Details
TargetC-C chemokine receptor type 4
LigandBDBM50142347
Substrate/Competitorn/a
Meas. Tech.ChEMBL_887603 (CHEMBL2217212)
IC50 140±n/a nM
Citation Jain, AKVaidya, ARavichandran, VKashaw, SKAgrawal, RK Recent developments and biological activities of thiazolidinone derivatives: a review. Bioorg Med Chem20:3378-95 (2012) 
 
C-C chemokine receptor type 4
Name:C-C chemokine receptor type 4
Type:Enzyme
Mol. Mass.:41406.41
Organism:Homo sapiens (Human)
Description:P51679
Residue:360
BDBM50142347
NameBDBM50142347
Synonyms:2-[(2R,5R)-5-[(3-Chloro-2-methyl-benzylcarbamoyl)-methyl]-2-(2,4-dichloro-phenyl)-4-oxo-thiazolidin-3-yl]-N-(3-piperidin-1-yl-propyl)-acetamide | CHEMBL43698
TypeSmall organic molecule
Emp. Form.C29H35Cl3N4O3S
Mol. Mass.626.037
SMILESCc1c(Cl)cccc1CNC(=O)C[C@H]1S[C@@H](N(CC(=O)NCCCN2CCCCC2)C1=O)c1ccc(Cl)cc1Cl