Reaction Details
TargetTyrosine-protein kinase BTK
LigandBDBM50403056
Substrate/Competitorn/a
Meas. Tech.ChEMBL_887637 (CHEMBL2217246)
IC50<1±n/a nM
Citation Barf, TKaptein, A Irreversible protein kinase inhibitors: balancing the benefits and risks. J Med Chem55:6243-62 (2012) 
 
Tyrosine-protein kinase BTK
Name:Tyrosine-protein kinase BTK
Type:Enzyme
Mol. Mass.:76289.95
Organism:Homo sapiens (Human)
Description:Q06187
Residue:659
BDBM50403056
NameBDBM50403056
Synonyms:CHEMBL2216827 US10828300, Compound I-342 US9987276, Compound I-342
TypeSmall organic molecule
Emp. Form.C26H22FN7O3
Mol. Mass.499.4964
SMILESCNC(=O)c1cc(Oc2ccc(Nc3ncc(F)c(Nc4cccc(NC(=O)C=C)c4)n3)cc2)ccn1