Reaction Details
TargetProto-oncogene tyrosine-protein kinase Src
LigandBDBM4566
Substrate/Competitorn/a
Meas. Tech.ChEMBL_887649 (CHEMBL2217258)
IC50>27000±n/a nM
Citation Barf, TKaptein, A Irreversible protein kinase inhibitors: balancing the benefits and risks. J Med Chem55:6243-62 (2012) 
 
Proto-oncogene tyrosine-protein kinase Src
Name:Proto-oncogene tyrosine-protein kinase Src
Type:Tyr protein kinase
Mol. Mass.:60015.36
Organism:Gallus gallus (Chicken)
Description:P00523
Residue:533
BDBM4566
NameBDBM4566
Synonyms:4-anilinoquinazoline deriv. 1 N-{4-[(3-bromophenyl)amino]quinazolin-6-yl}but-2-ynamide
TypeSmall organic molecule
Emp. Form.C18H13BrN4O
Mol. Mass.381.226
SMILESCC#CC(=O)Nc1ccc2ncnc(Nc3cccc(Br)c3)c2c1