Reaction Details
TargetReceptor tyrosine-protein kinase erbB-2
LigandBDBM112499
Substrate/Competitorn/a
Meas. Tech.ChEMBL_887633 (CHEMBL2217242)
IC50 46±n/a nM
Citation Barf, TKaptein, A Irreversible protein kinase inhibitors: balancing the benefits and risks. J Med Chem55:6243-62 (2012) 
 
Receptor tyrosine-protein kinase erbB-2
Name:Receptor tyrosine-protein kinase erbB-2
Type:n/a
Mol. Mass.:137894.47
Organism:Homo sapiens (Human)
Description:P04626
Residue:1255
BDBM112499
NameBDBM112499
Synonyms:DACOMITINIB WO2022090481, Example dacomitinib
TypeSmall organic molecule
Emp. Form.C24H25ClFN5O2
Mol. Mass.469.939
SMILESCOc1cc2ncnc(Nc3ccc(F)c(Cl)c3)c2cc1NC(=O)\C=C\CN1CCCCC1