Reaction Details
TargetPhosphatidylinositol 4,5-bisphosphate 3-kinase catalytic subunit delta isoform
LigandBDBM50004546
Substrate/Competitorn/a
Meas. Tech.ChEMBL_887653 (CHEMBL2217262)
IC50<250±n/a nM
Citation Cushing, TDMetz, DPWhittington, DAMcGee, LR PI3Kd and PI3K¿ as targets for autoimmune and inflammatory diseases. J Med Chem55:8559-81 (2012) 
 
Phosphatidylinositol 4,5-bisphosphate 3-kinase catalytic subunit delta isoform
Name:Phosphatidylinositol 4,5-bisphosphate 3-kinase catalytic subunit delta isoform
Type:Enzyme Subunit
Mol. Mass.:119489.41
Organism:Homo sapiens (Human)
Description:O00329
Residue:1044
BDBM50004546
NameBDBM50004546
Synonyms:CHEMBL2216861
TypeSmall organic molecule
Emp. Form.C22H16FN5O2
Mol. Mass.401.3931
SMILESCC(c1oc2ccccc2c(=O)c1-c1cccc(F)c1)n1cnc2c(N)ncnc12