Reaction Details
TargetPhosphatidylinositol 4,5-bisphosphate 3-kinase catalytic subunit delta isoform
LigandBDBM50004543
Substrate/Competitorn/a
Meas. Tech.ChEMBL_887683 (CHEMBL2217292)
IC50<100±n/a nM
Citation Cushing, TDMetz, DPWhittington, DAMcGee, LR PI3Kd and PI3K¿ as targets for autoimmune and inflammatory diseases. J Med Chem55:8559-81 (2012) 
 
Phosphatidylinositol 4,5-bisphosphate 3-kinase catalytic subunit delta isoform
Name:Phosphatidylinositol 4,5-bisphosphate 3-kinase catalytic subunit delta isoform
Type:Enzyme Subunit
Mol. Mass.:119489.41
Organism:Homo sapiens (Human)
Description:O00329
Residue:1044
BDBM50004543
NameBDBM50004543
Synonyms:CHEMBL2216843
TypeSmall organic molecule
Emp. Form.C26H20FN7O2S
Mol. Mass.513.546
SMILESCc1csc2nc(Cn3nc(-c4cc(O)cc(F)c4)c4c(N)ncnc34)n(-c3ccccc3C)c(=O)c12