Reaction Details
TargetPhosphatidylinositol 4,5-bisphosphate 3-kinase catalytic subunit delta isoform
LigandBDBM50004539
Substrate/Competitorn/a
Meas. Tech.ChEMBL_887705 (CHEMBL2217314)
IC50<50±n/a nM
Citation Cushing, TDMetz, DPWhittington, DAMcGee, LR PI3Kd and PI3K¿ as targets for autoimmune and inflammatory diseases. J Med Chem55:8559-81 (2012) 
 
Phosphatidylinositol 4,5-bisphosphate 3-kinase catalytic subunit delta isoform
Name:Phosphatidylinositol 4,5-bisphosphate 3-kinase catalytic subunit delta isoform
Type:Enzyme Subunit
Mol. Mass.:119489.41
Organism:Homo sapiens (Human)
Description:O00329
Residue:1044
BDBM50004539
NameBDBM50004539
Synonyms:CHEMBL2216867 US10519163, Example 33 US11136326, Example 33 | US9708333, 33
TypeSmall organic molecule
Emp. Form.C21H15ClFN7
Mol. Mass.419.842
SMILESCC(Nc1ncnc2[nH]cnc12)c1cc(Cl)c2ccnnc2c1-c1cccc(F)c1