Reaction Details
TargetPhosphatidylinositol 4,5-bisphosphate 3-kinase catalytic subunit delta isoform
LigandBDBM50403063
Substrate/Competitorn/a
Meas. Tech.ChEMBL_887692 (CHEMBL2217301)
IC50 570±n/a nM
Citation Cushing, TDMetz, DPWhittington, DAMcGee, LR PI3Kd and PI3K¿ as targets for autoimmune and inflammatory diseases. J Med Chem55:8559-81 (2012) 
 
Phosphatidylinositol 4,5-bisphosphate 3-kinase catalytic subunit delta isoform
Name:Phosphatidylinositol 4,5-bisphosphate 3-kinase catalytic subunit delta isoform
Type:Enzyme Subunit
Mol. Mass.:119489.41
Organism:Homo sapiens (Human)
Description:O00329
Residue:1044
BDBM50403063
NameBDBM50403063
Synonyms:CHEMBL2216862 | US9321773, 15
TypeSmall organic molecule
Emp. Form.C30H23N7O3
Mol. Mass.529.5487
SMILESCOc1cccc(Cn2c(Cn3nc(-c4cccc(O)c4)c4c(N)ncnc34)nc3cccc(C#C)c3c2=O)c1