Reaction Details
TargetPhosphatidylinositol 4,5-bisphosphate 3-kinase catalytic subunit gamma isoform
LigandBDBM81368
Substrate/Competitorn/a
Meas. Tech.ChEMBL_887662 (CHEMBL2217271)
IC50 18±n/a nM
Citation Cushing, TDMetz, DPWhittington, DAMcGee, LR PI3Kd and PI3K¿ as targets for autoimmune and inflammatory diseases. J Med Chem55:8559-81 (2012) 
 
Phosphatidylinositol 4,5-bisphosphate 3-kinase catalytic subunit gamma isoform
Name:Phosphatidylinositol 4,5-bisphosphate 3-kinase catalytic subunit gamma isoform
Type:Enzyme Subunit
Mol. Mass.:126470.30
Organism:Homo sapiens (Human)
Description:P48736
Residue:1102
BDBM81368
NameBDBM81368
Synonyms:PIK90
TypeSmall organic molecule
Emp. Form.C18H17N5O3
Mol. Mass.351.3593
SMILESCOc1ccc2C3=NCCN3C(NC(=O)c3cccnc3)=Nc2c1OC