Reaction Details
TargetPhosphatidylinositol 4,5-bisphosphate 3-kinase catalytic subunit delta isoform
LigandBDBM50403088
Substrate/Competitorn/a
Meas. Tech.ChEMBL_887653 (CHEMBL2217262)
IC50 3±n/a nM
Citation Cushing, TDMetz, DPWhittington, DAMcGee, LR PI3Kd and PI3K¿ as targets for autoimmune and inflammatory diseases. J Med Chem55:8559-81 (2012) 
 
Phosphatidylinositol 4,5-bisphosphate 3-kinase catalytic subunit delta isoform
Name:Phosphatidylinositol 4,5-bisphosphate 3-kinase catalytic subunit delta isoform
Type:Enzyme Subunit
Mol. Mass.:119489.41
Organism:Homo sapiens (Human)
Description:O00329
Residue:1044
BDBM50403088
NameBDBM50403088
Synonyms:CHEMBL2216844
TypeSmall organic molecule
Emp. Form.C20H25N5O2S
Mol. Mass.399.51
SMILESCOc1cc2c(CC3CCCC(C)C3)c(sc2cc1C)C(=O)Nc1nnn[nH]1