Reaction Details
TargetPhosphatidylinositol 4,5-bisphosphate 3-kinase catalytic subunit delta isoform
LigandBDBM50403092
Substrate/Competitorn/a
Meas. Tech.ChEMBL_887653 (CHEMBL2217262)
Ki 7±n/a nM
Citation Cushing, TDMetz, DPWhittington, DAMcGee, LR PI3Kd and PI3K¿ as targets for autoimmune and inflammatory diseases. J Med Chem55:8559-81 (2012) 
 
Phosphatidylinositol 4,5-bisphosphate 3-kinase catalytic subunit delta isoform
Name:Phosphatidylinositol 4,5-bisphosphate 3-kinase catalytic subunit delta isoform
Type:Enzyme Subunit
Mol. Mass.:119489.41
Organism:Homo sapiens (Human)
Description:O00329
Residue:1044
BDBM50403092
NameBDBM50403092
Synonyms:CHEMBL2216871 | US8691829, 4a
TypeSmall organic molecule
Emp. Form.C22H19N7O
Mol. Mass.397.4326
SMILESCC(c1nc2cccc(C)c2c(=O)n1-c1ccccc1)n1cnc2c(N)ncnc12