Reaction Details
TargetPhosphatidylinositol 4,5-bisphosphate 3-kinase catalytic subunit delta isoform
LigandBDBM50323736
Substrate/Competitorn/a
Meas. Tech.ChEMBL_887653 (CHEMBL2217262)
IC50 34±n/a nM
Citation Cushing, TDMetz, DPWhittington, DAMcGee, LR PI3Kd and PI3K¿ as targets for autoimmune and inflammatory diseases. J Med Chem55:8559-81 (2012) 
 
Phosphatidylinositol 4,5-bisphosphate 3-kinase catalytic subunit delta isoform
Name:Phosphatidylinositol 4,5-bisphosphate 3-kinase catalytic subunit delta isoform
Type:Enzyme Subunit
Mol. Mass.:119489.41
Organism:Homo sapiens (Human)
Description:O00329
Residue:1044
BDBM50323736
NameBDBM50323736
Synonyms:2-(3-(2-methoxyphenyl)-4-oxo-3,4,5,6,7,8-hexahydroquinazolin-2-ylthio)-N-(quinoxalin-6-yl)acetamide CHEMBL1213169
TypeSmall organic molecule
Emp. Form.C25H23N5O3S
Mol. Mass.473.547
SMILESCOc1ccccc1-n1c(SCC(=O)Nc2ccc3nccnc3c2)nc2CCCCc2c1=O