Reaction Details
Target5-hydroxytryptamine receptor 1A
LigandBDBM86708
Substrate/Competitorn/a
Meas. Tech.ChEMBL_1519 (CHEMBL616153)
Ki 0.501187±n/a nM
Citation van Steen, BJvan Wijngaarden, IRonken, ESoudijn, W Functional characteristics of a series of N4-substituted 1-(2,3-dihydro-1,4-benzodioxin-5-yl)piperazines as 5-HT1A receptor ligands. Structure-activity relationships. Bioorg Med Chem Lett8:2457-62 (1999) 5-hydroxytryptamine receptor 1A
Name:5-hydroxytryptamine receptor 1A
Type:G Protein-Coupled Receptor (GPCR)
Mol. Mass.:46445.29
Organism:Rattus norvegicus (rat)
Description:Binding assays were performed using rat hippocampal membranes.
Residue:422
BDBM86708
NameBDBM86708
Synonyms:CAS_146714-97-8 CHEMBL514874 NSC_104911 | WAY 100,635
TypeSmall organic molecule
Emp. Form.C25H34N4O2
Mol. Mass.422.5631
SMILESCOc1ccccc1N1CCN(CCN(C(=O)C2CCCCC2)c2ccccn2)CC1